PRESENTED BY Adobe Express
replacing rca plugs without soldering
vintage chuck wagon

Com android build gradle tasks packageandroidartifact incrementalsplitterrunnable

tengo algunos problemas. Estoy tratando de compilar la Aplicación para "release" desde Android Studio, la misma esta en Flutter. Sin embargo tenía este error: A problem occurred evaluating.
By house name plaques  on 
MYAPP_UPLOAD_STORE_FILE хранится в gradle.properties, а остальные в env vars. У меня есть эта ошибка. FAILURE: Build failed with an exception. * What went wrong: Execution failed for task ':app:packageRelease'. > A failure occurred while executing com.android.build.gradle.tasks.PackageAndroidArtifact.

prentice hall algebra 1 answer key pdf

files not copying to external hard drive

how old was elvis when he died

Software Engineering. Android Engineer. Android Technical Lead. iOS Engineer. Flutter Web Engineer. Flutter & Dart Native Runtime Engineer.
Pros & Cons

free shopping mod apk

redmi 7 flash without authorized account

com.android.build.gradle.api Classes. AndroidBasePlugin: Common plugin applied by all plugins. ... Check out Android Developers on YouTube. LinkedIn Connect with the Android Developers.
Pros & Cons

samsung a21 screen mirroring no wifi

good music captions

cd android on the project. ./gradlew clean and then ./gradlew bundleRelease to clean the project and create aab file. app-release.aab is now in [your_project]/android/app/build/outputs/bundle/release Then, ./gradle installRelease, or cd .. and react-native run-android --variant=release to lunch the aab on your device/emulator.
Pros & Cons

how to buy on stockx reddit

once on this island movie

AS签名打包报错记录:com.android.ide.common.signing.KeytoolException: Failed to read key TraPlaApp from st(解决).
Pros & Cons

mmdetection albumentations

24v lorry inverter

Additional steps on Android . For the react-native-pytorch-core React Native package to work on Android, it requires three changes to the gradle.properties and the two build.gradle files to increase JVM memory, add Sonatype repository, and packaging options with pick first rule.. Increase JVM Memory . Increase the memory for the JVM to avoid OutOfMemory exceptions during the packaging process.
Pros & Cons

thenisai thendral deva mp3 songs free download masstamilan

corsa d u2105

Go to <your_app_name>/android. On the terminal use ./gradlew signingReport for Mac OS and gradlew signingReport for Windows. Check if each element of each task has a Variant, Config,.
Pros & Cons

ankle cowboy boots

beneteau first 53 prix

本文介绍了执行com.android.build.gradle.tasks.PackageAndroidArtifact $ IncrementalSplitterRunnable时发生故障的处理方法,对大家解决问题具有一定的参考价值,需要的朋友们下面随着小编来一起学习吧! 问题描述 当我尝试转换APK中的登录时出现错误.在工作之前.添加buildTyper后,它不起作用.谁能帮我解决这个问题?还是做错了什么?.
Pros & Cons

8x8x10 douglas fir post

pitcher list top 100

解决 Execution failed for task':app :mergeDebugResources...'.首先先查看自己的路径是否有问题其次检查jdk版本与本机的jdk版本与本机的jdk.
Pros & Cons
lse summer school accommodation Tech what else to replace when replacing alternator wedding flyer template free

. Android toolchain - develop for Android devices (Android SDK version 31.0.0) Xcode - develop for iOS and macOS; Chrome - develop for the web; Android Studio (version 2020.3).

deleting ~/.android/debug.keystore file. score:2. This happens when disable screen capture disableScreenCapture (). Verify and delete the following code if you use it on MainActivity inside onCreate () method. getWindow ().setFlags (WindowManager.LayoutParams.FLAG_SECURE, WindowManager.LayoutParams.FLAG_SECURE); FLAG_SECURE Window flag: treat the content of the window as secure. .

Android Gradle plugin requires Java 11 to run. You are currently using Java 1.8. process finished with exit code 0 intellij show all debug points intellij Eclipse find/replace pluggin unable to find bundled java version. flutter laravel Please update to at least Node v12.14 Can't run 1.18 Server jar file. Andriod build error Execution failed for task &#39;:app:packageDebug&#39;. &gt; A failure occurred while executing com.android.build.gradle.tasks. A few years ago I decided to learn Reanimated and React Native Gesture Handler by building a bunch of fun little gesture-based animations. These were all built using the v1 APIs and taught me a lot about making natural-feeling and performant animations.

haese mathematics grade 7 pdf free download

deleting ~/.android/debug.keystore file.

I am attempting to test a game on my android cellphone. I have it connected and targeted as the device, and it is connected successfully. I have downloaded android studio, the latest SDK files, the default NDK, and JDK, as well as pointed game maker to their file location.

  • The text was updated successfully, but these errors were encountered:. A few years ago I decided to learn Reanimated and React Native Gesture Handler by building a bunch of fun little gesture-based animations. These were all built using the v1 APIs and taught me a lot about making natural-feeling and performant animations. FAILURE: Build failed with an exception. What went wrong: Execution failed for task ‘:app:checkDebugAarMetadata’. Multiple task action failures occurred:.

  • This topic has been deleted. Only users with topic management privileges can see it. Firebase Test Run: Provide a Firebase test run report link here showcasing the problem Stacktrace: &gt; Task :app:minifyReleaseWithR8 WARNING:R8: The method. Run with --info or --debug option to get more log output. Run with --scan to get full insights. * Get more help at https://help.gradle.org Deprecated Gradle features were used in this build, making it incompatible with Gradle 7.0. Use '--warning-mode all' to show the individual deprecation warnings. I get this both on my local machine and CI, even after clearing all the gradle caches. I looked through the changes from 5.0.0-5.1.0 (v5.0.0...v5.1.0) but I don't see what could have caused this. Running with --stacktrace or --scan doesn't provide more details. My project is using Gradle 7.3.1. Compile SDK & target SDK = 31.

To learn more about multidex, view the official Android documentation.. Enabling Multidex. There are 3 steps involved in enabling multidex. Steps 1 and 2 tell Gradle to turn on multidex with a directive, and add new dependency. To see all tasks and more detail, run gradlew tasks --all To see more detail about a task, run gradlew help --task <task>. These commands exist to help you with tasks like project. Ariyo Asks: flutter build apk --split-per-abi: Execution failed for task ':app:packageRelease' i have been trying to build a flutter apk with this flutter build apk --split-per-abi: but i seem to be getting this error, i tried to do some refactoring and corrections from StackOverflow but the.

2060 super ethereum hashrate

Add this line to gradle.properties. org.gradle.jvmargs=-Xmx4608m.

  • where to get stem cell therapy

  • ffmpeg gui

  • best and worst used toyotas to buy

  • tarkov lighthouse map

  • new casinos 2022

  • crab festival 2023

  • restaurant space for lease calgary

  • books with neurodiverse characters

  • Today i came across this error while running flutter app in android devicea failure occurred while executing com.android.build.gradle.internal.tasks.Workers$.

  • samsung dolby vision reddit

  • direct damage yugioh deck

  • cheap cars for sale in west palm beach

  • ipsec phase 1 and phase 2 configuration fortigate

  • garden of life founder dead

The following defines the version and build number for your application. A version number is three numbers separated by dots, like 1.2.43 followed by an optional build number separated by a +. Both the version and the builder number may be overridden in flutter build by specifying --build-name and --build-number, respectively.

best vape accessories

A failure occurred while executing com.android.build.gradle.tasks.MergeResources解决方法. 从git上git下来的项目,之前用其他电脑都没有问题,各种查阅网上资料说是9.png的问题,于是在gradle.build里加了跳过检查错误9.png的错误。 然而并无多大用处,还是报了一样的错误。. Find the xml "linear_indeterminate_line1_head_interpolator.xml", remove it if not necessary, and if necessary try to find the same duplicate file in File Explorer (Sometimes it does not appear in. To compile a desktop application, you must build it on the targeted platform: build a Windows application on Windows, a macOS application on macOS, and a Linux application on Linux. To create a Flutter application with desktop support, you need the following software: Flutter SDK. See the Flutter SDK installation instructions. Software Engineering. Android Engineer. Android Technical Lead. iOS Engineer. Flutter Web Engineer. Flutter & Dart Native Runtime Engineer. This issue occurs when I'm trying to build APK. Otherwise, when I'm running the application it runs without any issue. Here's the logcat for details: Execution failed for task ':app:packageGeneralQ.

morbilliform rash in adults

Ariyo Asks: flutter build apk --split-per-abi: Execution failed for task ':app:packageRelease' i have been trying to build a flutter apk with this flutter build apk --split-per-abi: but i seem to be getting this error, i tried to do some refactoring and corrections from StackOverflow but the.

screenshots of the merida and maca squarespace templates side by side
graal era upload viewer gym sound system price

Software Engineering. Android Engineer. Android Technical Lead. iOS Engineer. Flutter Web Engineer. Flutter & Dart Native Runtime Engineer. 首先请更新您的 sdk(android,dart 和颤振)接下来运行flutter clean然后运行flutter build apk --split-per-abi 试过了,不成功。 我终于通过完全删除 Android Studio、SDK 和 flutter 然后重新安装来让它工作。.

how long do ground bees stay

Firebase Test Run: Provide a Firebase test run report link here showcasing the problem Stacktrace: &gt; Task :app:minifyReleaseWithR8 WARNING:R8: The method `org.slf4j.helpers.NOPMDCAdapter org.slf. A workaround I've found involves tweaking the android memory settings in the project gradle file (android/gradle.properties). Changing the Changing the org.gradle.jvmargs.

  • razorback rack

  • com.android.build.gradle.api Classes. AndroidBasePlugin: Common plugin applied by all plugins. ... Check out Android Developers on YouTube. LinkedIn Connect with the Android Developers.

  • 这个问题发生在我试图构建APK的时候。否则,当我运行应用程序时,它运行时没有任何问题。 以下是详细信息的logcat:.

  • observium api examples

  • estazolam brand name

  • Today i came across this error while running flutter app in android devicea failure occurred while executing com.android.build.gradle.internal.tasks.Workers$.

  • score:2. This happens when disable screen capture disableScreenCapture (). Verify and delete the following code if you use it on MainActivity inside onCreate () method. getWindow ().setFlags (WindowManager.LayoutParams.FLAG_SECURE, WindowManager.LayoutParams.FLAG_SECURE); FLAG_SECURE Window flag: treat the content of the window as secure.

C++ ; change int to string cpp; integer to string c++; flutter convert datetime in day of month; dateformat in flutter; flutter datetime format; delete specific vector element c++.

The following defines the version and build number for your application. A version number is three numbers separated by dots, like 1.2.43 followed by an optional build number separated by a +. Both the version and the builder number may be overridden in flutter build by specifying --build-name and --build-number, respectively.

how do i cancel my lloyds credit card
reminders of him reddit
xcom 2 wotc mods not loading 2022
  • Squarespace version: 7.1
amazon night shift pay 2022

C++ ; change int to string cpp; integer to string c++; flutter convert datetime in day of month; dateformat in flutter; flutter datetime format; delete specific vector element c++. Andriod build error Execution failed for task &#39;:app:packageDebug&#39;. &gt; A failure occurred while executing com.android.build.gradle.tasks.

mr vegas vouchers

obituary live 2021
home assistant energy cost entity
lewiston fireworks 2022
  • Squarespace version: 7.1
unity addressables remote load path

Run with --info or --debug option to get more log output. Run with --scan to get full insights. * Get more help at https://help.gradle.org BUILD FAILED in 1m 48s Running Gradle.

I am attempting to test a game on my android cellphone. I have it connected and targeted as the device, and it is connected successfully. I have downloaded android studio, the latest SDK files, the default NDK, and JDK, as well as pointed game maker to their file location. (See Preferences.

how to allow circular reference in excel
proctor funeral home obituaries
massage envy troy
  • Squarespace version: 7.1
chest pain in morning when waking up reddit

Software Engineering. Android Engineer. Android Technical Lead. iOS Engineer. Flutter Web Engineer. Flutter & Dart Native Runtime Engineer. Android 开机动画客制化_Frank_de_Boer的博客-程序员ITS301; C#使用App.config和INI两种方式读写配置文件_Huber~的博客-程序员ITS301_c# 读取配置文件的方法; 基于anaconda安装Pytorch,并安装PyG图网络框架_小安同学apj的博客-程序员ITS301. Needs: Author Feedback Needs: Environment Info Please run `react-native info` and edit your issue with that command's output. Resolution: Locked This issue was locked by the bot. Tech: Bundler 📦 This issue is related to the bundler (Metro, Haul, etc) used. A failure occurred while executing com.android.build.gradle.internal.tasks.Workers$ActionFacade More than one file was found with OS independent path 'AndroidManifest.xml' Try: Run with --stacktrace option to get the stack trace. Run with --info or --debug option to get more log output. Run with --scan to get full insights. When I run flutter devices I don't see my device even if it is connected. I can access my devices with Android Studio but not with CMD or terminals; Not able to run the flutter firebase web app on google chrome; Run flutter web with docker. Command flutter not found; Flutter web build cant run gif on firebase.

arkansas drug bust today

best spring water uk
blackjack mathematics pdf
usda quick stats
  • Squarespace version: 7.0

To learn more about multidex, view the official Android documentation.. Enabling Multidex. There are 3 steps involved in enabling multidex. Steps 1 and 2 tell Gradle to turn on multidex with a directive, and add new dependency. The text was updated successfully, but these errors were encountered:.

dji fpv battery not charging

ikmanlk three wheel beliatta
creeque alley analysis
village pubs near birmingham
  • Squarespace version: 7.1
gotham garage vaydor

If you want to make your own Gradle Wrapper, then download Gradle from here and then execute the following command in your project directory: $ gradle wrapper --gradle. . C++ ; integer to string c++; change int to string cpp; flutter convert datetime in day of month; dateformat in flutter; flutter datetime format; delete specific vector element c++. Software Engineering. Android Engineer. Android Technical Lead. iOS Engineer. Flutter Web Engineer. Flutter & Dart Native Runtime Engineer. 2022-07-17. 其他开发. android performance android-studio apk android-install-apk. 本文是小编为大家收集整理的关于 执.

12 foot boat for sale

twin sets marks and spencer
2016 hyundai tucson repair manual
to my 17 year old son
  • Squarespace version: 7.1
master entry indicator free download

> A failure occurred while executing com.android.build.gradle.tasks.PackageAndroidArtifact$IncrementalSplitterRunnable > java.lang.OutOfMemoryError (no error message) * Try: Run with --info or --debug option to get more log output. Run with --scan to get full insights. Andriod build error Execution failed for task &#39;:app:packageDebug&#39;. &gt; A failure occurred while executing com.android.build.gradle.tasks. Android Export Module Version 2.0. Android Extensions; Android Releases; XNA Export Module Version 2.0. Xbox Play testing & Peer Review; XNA Specific Example Files; XNA. Today i came across this error while running flutter app in android devicea failure occurred while executing com.android.build.gradle.internal.tasks.Workers$. A failure occurred while executing com.android.build.gradle.tasks.PackageAndroidArtifact$IncrementalSplitterRunnable #3,. Software Engineering. Android Engineer. Android Technical Lead. iOS Engineer. Flutter Web Engineer. Flutter & Dart Native Runtime Engineer.

brutelogic xss svg

brick wall blender model
air alarm
english literature a level paper 3
  • Squarespace version: 7.1
tmnt fanfiction mikey blind

* What went wrong: Execution failed for task ':app:bundleReleaseJsAndAssets'. > Process 'command 'node'' finished with non-zero exit value 1 해결 : build할때 commend 를./gradlew bundleRelease 이것으. Pandas how to find column contains a certain value Recommended way to install multiple Python versions on Ubuntu 20.04 Build super fast web scraper with Python x100 than BeautifulSoup How. 2022-07-17. 其他开发. android performance android-studio apk android-install-apk. 本文是小编为大家收集整理的关于 执行com.android.build.gradle.tasks.packageandroidartifact $ increntalsplitterrunnable 的处理方法,想解了执行com.android.build.gradle.tasks.packageandroidartifact $ increntalsplitterrunnable的问题. Teams. Q&A for work. Connect and share knowledge within a single location that is structured and easy to search. Learn more about Teams. Andriod build errror Execution failed for task ':app:packageDebug'. > A failure occurred while executing com.android.build.gradle.tasks.PackageAndroidArtifact. deleting ~/.android/debug.keystore file. Level up your programming skills with exercises across 52 languages, and insightful discussion with our dedicated team of welcoming mentors. Answers Courses Tests Examples. A workaround I've found involves tweaking the android memory settings in the project gradle file (android/gradle.properties). Changing the Changing the org.gradle.jvmargs.

neue haas grotesk text pro 55 roman

free porn simple girl exploited
where is the quest archive in destiny 2
cheap apartments manhattan
  • Squarespace version: 7.1
how to increase odds of winning fantasy 5

* What went wrong: Execution failed for task ':app:bundleReleaseJsAndAssets'. > Process 'command 'node'' finished with non-zero exit value 1 해결 : build할때 commend 를./gradlew bundleRelease 이것으. Pandas how to find column contains a certain value Recommended way to install multiple Python versions on Ubuntu 20.04 Build super fast web scraper with Python x100 than BeautifulSoup How. Hi, I searched through the posts for information on enabling the zip64 option in build.gradle for my Android Java app. I did find a reference to zip64 configuration in this forum conversation from 2016 However, simpl. Andriod build errror Execution failed for task ':app:packageDebug'. > A failure occurred while executing com.android.build.gradle.tasks.PackageAndroidArtifact. score:2. This happens when disable screen capture disableScreenCapture (). Verify and delete the following code if you use it on MainActivity inside onCreate () method. getWindow ().setFlags (WindowManager.LayoutParams.FLAG_SECURE, WindowManager.LayoutParams.FLAG_SECURE); FLAG_SECURE Window flag: treat the content of the window as secure. If you’re curious to see exactly what tasks are available, then: Open Android Studio’s Terminal window, if it isn’t already open (by selecting “View > Tools Windows > Terminal” from.

Firebase Test Run: Provide a Firebase test run report link here showcasing the problem Stacktrace: &gt; Task :app:minifyReleaseWithR8 WARNING:R8: The method `org.slf4j.helpers.NOPMDCAdapter org.slf.

can i get low income housing with an eviction


houdini point

skyrim character turning transparent

plumbers and pipefitters local 562 pension fund
sqlalchemy timestamp vs datetime

attorney general custody
educational youtube channels for kindergarten

plots for sale in barnabas nakuru
kovan test network metamask

border collie mix puppy for sale

nctb books pdf

one piece fanfiction watching impel down

ip psn username

home assistant ssh switch


showa shocks harley davidson

cocurricular and extracurricular activities in resume

car hire menorca airport

how many promises did god make in the bible
warrant search mn dakota county

police radio frequencies

focus on grammar 2 5th edition pdf free download

free lds sheet music piano

glitched 7 0 center

openjdk platform binary high cpu reddit

cheap houses for sale in istanbul turkey

removing ingrown toenail at home

cloud computing quiz questions and answers

deep throat face fuck
eset firewall settings
How to connect Any android device with Android studio لربط الأندرويد ستوديو مع موبايلك ، اتبع الخطوات التالية : أولاً : اشبك هاتفك بوصلة USB بجهازك الحاسوب ثانيا : ادخل الى "الضبط" >> Setting الموجودة في هاتفك الأندرويد ثالثاً : ضع اشارة صح امام.